BDBM76321 3-chloranyl-N-[3-(dimethylamino)propyl]-N-(6-methyl-1,3-benzothiazol-2-yl)-1-benzothiophene-2-carboxamide;hydrochloride::3-chloro-N-[3-(dimethylamino)propyl]-N-(6-methyl-1,3-benzothiazol-2-yl)-1-benzothiophene-2-carboxamide;hydrochloride::3-chloro-N-[3-(dimethylamino)propyl]-N-(6-methyl-1,3-benzothiazol-2-yl)benzothiophene-2-carboxamide;hydrochloride::MLS000696693::SMR000237207::cid_12006173
SMILES CN(C)CCCN(C(=O)c1sc2ccccc2c1Cl)c1nc2ccc(C)cc2s1
InChI Key InChIKey=NUDBUQXZPYOHDI-UHFFFAOYSA-N
Data  3 IC50
  Tab Delimited (TSV)   2D SDfile   Computed 3D by Vconf -m prep SDfile
Find this compound or compounds like it in BindingDB:
Activity Spreadsheet -- Enzyme Inhibition Constant Data from BindingDB
Found 1 hit for monomerid = 76321
TargetNACHT, LRR and PYD domains-containing protein 1(Homo sapiens (Human))
Burnham Center For Chemical Genomics
Curated by PubChem BioAssay
LigandPNGBDBM76321(3-chloranyl-N-[3-(dimethylamino)propyl]-N-(6-methy...)
Affinity DataIC50:  1.69E+4nM. Assay description: Data Source: Sanford-Burnham Center for Chemical Genomics (SBCCG) Source Affiliation: Sanford-Burnham Medical Research Institute (SBMRI, San Diego, C...
In DepthDetails PCBioAssay